Reaction Details
TargetNitric oxide synthase, inducible
LigandBDBM50363272
Substrate/Competitorn/a
Meas. Tech.ChEMBL_800845 (CHEMBL1948397)
IC50 33±n/a nM
Citation Durón, SGLindstrom, ABonnefous, CZhang, HChen, XSymons, KTSablad, MRozenkrants, NZhang, YWang, LYazdani, NShiau, AKNoble, SARix, PRao, TSHassig, CASmith, ND Heteroaromatic-aminomethyl quinolones: potent and selective iNOS inhibitors. Bioorg Med Chem Lett22:1237-41 (2012) 
 
Nitric oxide synthase, inducible
Name:Nitric oxide synthase, inducible
Type:Homodimer
Mol. Mass.:131141.95
Organism:Homo sapiens (Human)
Description:P35228
Residue:1153
BDBM50363272
NameBDBM50363272
Synonyms:CHEMBL1944886
TypeSmall organic molecule
Emp. Form.C21H15ClF2N4O
Mol. Mass.412.82
SMILESCc1nccc(n1)N(Cc1cc(=O)[nH]c2c(F)c(F)ccc12)c1cccc(Cl)c1