Reaction Details
TargetAcyl-CoA desaturase 1
LigandBDBM50364041
Substrate/Competitorn/a
Meas. Tech.ChEMBL_805304 (CHEMBL1955197)
IC50 2±n/a nM
Citation Lachance, NGuiral, SHuang, ZLeclerc, JPLi, CSOballa, RMRamtohul, YKWang, HWu, JZhang, L Discovery of potent and liver-selective stearoyl-CoA desaturase (SCD) inhibitors in an acyclic linker series. Bioorg Med Chem Lett22:623-7 (2011) 
 
Acyl-CoA desaturase 1
Name:Acyl-CoA desaturase 1
Type:Enzyme
Mol. Mass.:41485.97
Organism:Rattus norvegicus (Rat)
Description:P07308
Residue:358
BDBM50364041
NameBDBM50364041
Synonyms:CHEMBL1950551
TypeSmall organic molecule
Emp. Form.C16H13BrF3N5O5S
Mol. Mass.524.269
SMILESOC(=O)Cn1nnc(n1)-c1cnc(OCCCOc2cc(OC(F)(F)F)ccc2Br)s1