Reaction Details
TargetStearoyl-CoA desaturase
LigandBDBM50362592
Substrate/Competitorn/a
Meas. Tech.ChEMBL_805305 (CHEMBL1955198)
IC50 1070±n/a nM
Citation Lachance, NGuiral, SHuang, ZLeclerc, JPLi, CSOballa, RMRamtohul, YKWang, HWu, JZhang, L Discovery of potent and liver-selective stearoyl-CoA desaturase (SCD) inhibitors in an acyclic linker series. Bioorg Med Chem Lett22:623-7 (2011) 
 
Stearoyl-CoA desaturase
Name:Stearoyl-CoA desaturase
Type:Enzyme
Mol. Mass.:41537.27
Organism:Homo sapiens (Human)
Description:O00767
Residue:359
BDBM50362592
NameBDBM50362592
Synonyms:CHEMBL1938870
TypeSmall organic molecule
Emp. Form.C17H16BrFN6O4
Mol. Mass.467.249
SMILESOC(=O)Cn1nnc(n1)-c1cc(no1)N1CCC(CC1)Oc1cc(F)ccc1Br