Reaction Details
TargetAcyl-CoA desaturase 1
LigandBDBM50362592
Substrate/Competitorn/a
Meas. Tech.ChEMBL_805306 (CHEMBL1955199)
IC50 68±n/a nM
Citation Lachance, NGuiral, SHuang, ZLeclerc, JPLi, CSOballa, RMRamtohul, YKWang, HWu, JZhang, L Discovery of potent and liver-selective stearoyl-CoA desaturase (SCD) inhibitors in an acyclic linker series. Bioorg Med Chem Lett22:623-7 (2011) 
 
Acyl-CoA desaturase 1
Name:Acyl-CoA desaturase 1
Type:Enzyme
Mol. Mass.:41485.97
Organism:Rattus norvegicus (Rat)
Description:P07308
Residue:358
BDBM50362592
NameBDBM50362592
Synonyms:CHEMBL1938870
TypeSmall organic molecule
Emp. Form.C17H16BrFN6O4
Mol. Mass.467.249
SMILESOC(=O)Cn1nnc(n1)-c1cc(no1)N1CCC(CC1)Oc1cc(F)ccc1Br