Reaction Details
TargetEndothelial lipase
LigandBDBM26134
Substrate/Competitorn/a
Meas. Tech.ChEMBL_804415 (CHEMBL1954842)
IC50 1000±n/a nM
Citation O'Connell, DPLeBlanc, DFCromley, DBillheimer, JRader, DJBachovchin, WW Design and synthesis of boronic acid inhibitors of endothelial lipase. Bioorg Med Chem Lett22:1397-401 (2012) 
 
Endothelial lipase
Name:Endothelial lipase
Type:Protein
Mol. Mass.:56805.62
Organism:Homo sapiens (Human)
Description:Q9Y5X9
Residue:500
BDBM26134
NameBDBM26134
Synonyms:(4-nonylphenyl)boranediol | Phenylboronic Acid, 13
TypeSmall organic molecule
Emp. Form.C15H25BO2
Mol. Mass.248.169
SMILESCCCCCCCCCc1ccc(cc1)B(O)O