Reaction Details
TargetMidkine
LigandBDBM50364349
Substrate/Competitorn/a
Meas. Tech.ChEMBL_805023 (CHEMBL1952884)
Kd 2030±n/a nM
Citation Tamura, JTsutsumishita-Nakai, NNakao, YKawano, MKato, STakeda, NNadanaka, SKitagawa, H Synthesis and interaction with midkine of biotinylated chondroitin sulfate tetrasaccharides. Bioorg Med Chem Lett22:1371-4 (2012) 
 
Midkine
Name:Midkine
Type:PROTEIN
Mol. Mass.:15605.71
Organism:Homo sapiens (Human)
Description:ChEMBL_805023
Residue:143
BDBM50364349
NameBDBM50364349
Synonyms:CHEMBL1950105
TypeSmall organic molecule
Emp. Form.C51H84N6O30S
Mol. Mass.1293.3
SMILESCC(=O)N[C@@H]1[C@@H](O)[C@@H](O)[C@@H](CO)O[C@H]1O[C@H]1[C@H](O)[C@@H](O)[C@H](O[C@H]2[C@@H](O)[C@@H](CO)O[C@@H](O[C@H]3[C@H](O)[C@@H](O)[C@H](OCCNC(=O)CCOCCOCCOCCOCCNC(=O)CCCC[C@@H]4SC[C@@H]5NC(=O)N[C@H]45)O[C@@H]3C(O)=O)[C@@H]2NC(C)=O)O[C@@H]1C(O)=O