Reaction Details
TargetLysosomal Pro-X carboxypeptidase
LigandBDBM50364669
Substrate/Competitorn/a
Meas. Tech.ChEMBL_802882 (CHEMBL1953700)
IC50 0.71±n/a nM
Citation Shen, HCDing, FXJiang, JVerras, AChabin, RMXu, STong, XChen, QXie, DLassman, MEBhatt, URGarcia-Calvo, MMGeissler, WShen, ZMurphy, BAGorski, JNWiltsie, JSinhaRoy, RHale, JJPinto, SShen, DM Discovery of benzodihydroisofurans as novel, potent, bioavailable and brain-penetrant prolylcarboxypeptidase inhibitors. Bioorg Med Chem Lett22:1550-6 (2012) 
 
Lysosomal Pro-X carboxypeptidase
Name:Lysosomal Pro-X carboxypeptidase
Type:PROTEIN
Mol. Mass.:55028.96
Organism:Mus musculus
Description:ChEMBL_1335505
Residue:491
BDBM50364669
NameBDBM50364669
Synonyms:CHEMBL1951458
TypeSmall organic molecule
Emp. Form.C25H21Cl2F3N2O
Mol. Mass.493.348
SMILESFC(F)(F)c1ccc(CN2CCC3(CC2)OC(c2ccccc32)c2cc(Cl)cc(Cl)c2)nc1