Reaction Details
TargetLysosomal Pro-X carboxypeptidase
LigandBDBM50364676
Substrate/Competitorn/a
Meas. Tech.ChEMBL_802883 (CHEMBL1953701)
IC50 23±n/a nM
Citation Shen, HCDing, FXJiang, JVerras, AChabin, RMXu, STong, XChen, QXie, DLassman, MEBhatt, URGarcia-Calvo, MMGeissler, WShen, ZMurphy, BAGorski, JNWiltsie, JSinhaRoy, RHale, JJPinto, SShen, DM Discovery of benzodihydroisofurans as novel, potent, bioavailable and brain-penetrant prolylcarboxypeptidase inhibitors. Bioorg Med Chem Lett22:1550-6 (2012) 
 
Lysosomal Pro-X carboxypeptidase
Name:Lysosomal Pro-X carboxypeptidase
Type:PROTEIN
Mol. Mass.:55028.96
Organism:Mus musculus
Description:ChEMBL_1335505
Residue:491
BDBM50364676
NameBDBM50364676
Synonyms:CHEMBL1951465 | US8785634, 1
TypeSmall organic molecule
Emp. Form.C25H22ClF3N2O2
Mol. Mass.474.903
SMILESFC(F)(F)Oc1ccc(CN2CCC3(CC2)OC(c2ccccc32)c2cc(Cl)ccn2)cc1