Reaction Details
TargetLysosomal Pro-X carboxypeptidase
LigandBDBM50364681
Substrate/Competitorn/a
Meas. Tech.ChEMBL_802883 (CHEMBL1953701)
IC50 10±n/a nM
Citation Shen, HCDing, FXJiang, JVerras, AChabin, RMXu, STong, XChen, QXie, DLassman, MEBhatt, URGarcia-Calvo, MMGeissler, WShen, ZMurphy, BAGorski, JNWiltsie, JSinhaRoy, RHale, JJPinto, SShen, DM Discovery of benzodihydroisofurans as novel, potent, bioavailable and brain-penetrant prolylcarboxypeptidase inhibitors. Bioorg Med Chem Lett22:1550-6 (2012) 
 
Lysosomal Pro-X carboxypeptidase
Name:Lysosomal Pro-X carboxypeptidase
Type:PROTEIN
Mol. Mass.:55028.96
Organism:Mus musculus
Description:ChEMBL_1335505
Residue:491
BDBM50364681
NameBDBM50364681
Synonyms:CHEMBL1951470
TypeSmall organic molecule
Emp. Form.C24H23ClFN3O
Mol. Mass.423.91
SMILESCC(N1CCC2(CC1)OC(c1ccccc21)c1cc(Cl)ccn1)c1ccc(F)cn1