Reaction Details
TargetMetabotropic glutamate receptor 1
LigandBDBM50364727
Substrate/Competitorn/a
Meas. Tech.ChEMBL_803068 (CHEMBL1954374)
Ki 13±n/a nM
Citation Bennett, CEBurnett, DAGreenlee, WJKnutson, CEKorakas, PLi, CTulshian, DWu, WLBertorelli, RFredduzzi, SGrilli, MLozza, GReggiani, AVeltri, A Fused tricyclic mGluR1 antagonists for the treatment of neuropathic pain. Bioorg Med Chem Lett22:1575-8 (2012) 
 
Metabotropic glutamate receptor 1
Name:Metabotropic glutamate receptor 1
Type:Enzyme Catalytic Domain
Mol. Mass.:133240.47
Organism:RAT
Description:metabotropic glutamate 1/2 0 RAT::P23385
Residue:1199
BDBM50364727
NameBDBM50364727
Synonyms:CHEMBL1951666
TypeSmall organic molecule
Emp. Form.C19H16FN3O2S
Mol. Mass.369.413
SMILESCOc1ccc(cc1F)-n1ccc2c(sc3nccc(N(C)C)c23)c1=O