Reaction Details
TargetMetabotropic glutamate receptor 1
LigandBDBM50364734
Substrate/Competitorn/a
Meas. Tech.ChEMBL_803068 (CHEMBL1954374)
Ki 204±n/a nM
Citation Bennett, CEBurnett, DAGreenlee, WJKnutson, CEKorakas, PLi, CTulshian, DWu, WLBertorelli, RFredduzzi, SGrilli, MLozza, GReggiani, AVeltri, A Fused tricyclic mGluR1 antagonists for the treatment of neuropathic pain. Bioorg Med Chem Lett22:1575-8 (2012) 
 
Metabotropic glutamate receptor 1
Name:Metabotropic glutamate receptor 1
Type:Enzyme Catalytic Domain
Mol. Mass.:133240.47
Organism:RAT
Description:metabotropic glutamate 1/2 0 RAT::P23385
Residue:1199
BDBM50364734
NameBDBM50364734
Synonyms:CHEMBL1951673
TypeSmall organic molecule
Emp. Form.C18H14N2O2S
Mol. Mass.322.381
SMILESCOc1ccnc2sc3c(ccn(-c4ccccc4C)c3=O)c12