Reaction Details
TargetMetabotropic glutamate receptor 1
LigandBDBM50364735
Substrate/Competitorn/a
Meas. Tech.ChEMBL_803068 (CHEMBL1954374)
Ki 32±n/a nM
Citation Bennett, CEBurnett, DAGreenlee, WJKnutson, CEKorakas, PLi, CTulshian, DWu, WLBertorelli, RFredduzzi, SGrilli, MLozza, GReggiani, AVeltri, A Fused tricyclic mGluR1 antagonists for the treatment of neuropathic pain. Bioorg Med Chem Lett22:1575-8 (2012) 
 
Metabotropic glutamate receptor 1
Name:Metabotropic glutamate receptor 1
Type:Enzyme Catalytic Domain
Mol. Mass.:133240.47
Organism:RAT
Description:metabotropic glutamate 1/2 0 RAT::P23385
Residue:1199
BDBM50364735
NameBDBM50364735
Synonyms:CHEMBL1951674
TypeSmall organic molecule
Emp. Form.C19H16N2O3S
Mol. Mass.352.407
SMILESCOc1ccc(c(C)c1)-n1ccc2c3c(OC)ccnc3sc2c1=O