Reaction Details
TargetMetabotropic glutamate receptor 1
LigandBDBM50364706
Substrate/Competitorn/a
Meas. Tech.ChEMBL_803068 (CHEMBL1954374)
Ki 12±n/a nM
Citation Bennett, CEBurnett, DAGreenlee, WJKnutson, CEKorakas, PLi, CTulshian, DWu, WLBertorelli, RFredduzzi, SGrilli, MLozza, GReggiani, AVeltri, A Fused tricyclic mGluR1 antagonists for the treatment of neuropathic pain. Bioorg Med Chem Lett22:1575-8 (2012) 
 
Metabotropic glutamate receptor 1
Name:Metabotropic glutamate receptor 1
Type:Enzyme Catalytic Domain
Mol. Mass.:133240.47
Organism:RAT
Description:metabotropic glutamate 1/2 0 RAT::P23385
Residue:1199
BDBM50364706
NameBDBM50364706
Synonyms:CHEMBL1951878
TypeSmall organic molecule
Emp. Form.C20H17N3OS
Mol. Mass.347.433
SMILESCc1ccc(cc1)-n1ccc2c(sc3nccc(NC4CC4)c23)c1=O