Reaction Details
TargetReceptor-type tyrosine-protein kinase FLT3
LigandBDBM50364833
Substrate/Competitorn/a
Meas. Tech.ChEMBL_803521 (CHEMBL1953269)
IC50>50000±n/a nM
Citation Hada, KSuda, AAsoh, KTsukuda, THasegawa, MSato, YOgawa, KKuramoto, SAoki, YShimma, NIshikawa, TKoyano, H Angiogenesis inhibitors identified by cell-based high-throughput screening: synthesis, structure-activity relationships and biological evaluation of 3-[(E)-styryl]benzamides that specifically inhibit endothelial cell proliferation. Bioorg Med Chem20:1442-60 (2012) 
 
Receptor-type tyrosine-protein kinase FLT3
Name:Receptor-type tyrosine-protein kinase FLT3
Type:Enzyme
Mol. Mass.:112888.62
Organism:Homo sapiens (Human)
Description:P36888
Residue:993
BDBM50364833
NameBDBM50364833
Synonyms:CHEMBL1949789
TypeSmall organic molecule
Emp. Form.C19H20ClNO4
Mol. Mass.361.819
SMILESCOc1ccc(cc1\C=C\c1ccc(Cl)cc1)C(=O)NC[C@H](O)CO