Reaction Details
TargetTyrosine-protein kinase Lyn
LigandBDBM50364833
Substrate/Competitorn/a
Meas. Tech.ChEMBL_803529 (CHEMBL1953277)
IC50>50000±n/a nM
Citation Hada, KSuda, AAsoh, KTsukuda, THasegawa, MSato, YOgawa, KKuramoto, SAoki, YShimma, NIshikawa, TKoyano, H Angiogenesis inhibitors identified by cell-based high-throughput screening: synthesis, structure-activity relationships and biological evaluation of 3-[(E)-styryl]benzamides that specifically inhibit endothelial cell proliferation. Bioorg Med Chem20:1442-60 (2012) 
 
Tyrosine-protein kinase Lyn
Name:Tyrosine-protein kinase Lyn
Type:Protein
Mol. Mass.:58575.92
Organism:Homo sapiens (Human)
Description:P07948
Residue:512
BDBM50364833
NameBDBM50364833
Synonyms:CHEMBL1949789
TypeSmall organic molecule
Emp. Form.C19H20ClNO4
Mol. Mass.361.819
SMILESCOc1ccc(cc1\C=C\c1ccc(Cl)cc1)C(=O)NC[C@H](O)CO