Reaction Details
TargetNeuronal acetylcholine receptor subunit alpha-7
LigandBDBM50364873
Substrate/Competitorn/a
Meas. Tech.ChEMBL_803919 (CHEMBL1954606)
Ki 1.2±n/a nM
Citation Schrimpf, MRSippy, KBBriggs, CAAnderson, DJLi, TJi, JFrost, JMSurowy, CSBunnelle, WHGopalakrishnan, MMeyer, MD SAR ofa7 nicotinic receptor agonists derived from tilorone: exploration of a novel nicotinic pharmacophore. Bioorg Med Chem Lett22:1633-8 (2012) 
 
Neuronal acetylcholine receptor subunit alpha-7
Name:Neuronal acetylcholine receptor subunit alpha-7
Type:Enzyme
Mol. Mass.:56502.44
Organism:Rattus norvegicus (Rat)
Description:Q05941
Residue:502
BDBM50364873
NameBDBM50364873
Synonyms:CHEMBL1950154
TypeSmall organic molecule
Emp. Form.C27H32N4O
Mol. Mass.428.5692
SMILESCN1CC2CN(CC2C1)c1ccc2-c3ccc(cc3C(=O)c2c1)N1CC2CN(C)CC2C1