Reaction Details
TargetNeuronal acetylcholine receptor subunit alpha-7
LigandBDBM50364874
Substrate/Competitorn/a
Meas. Tech.ChEMBL_803919 (CHEMBL1954606)
Ki 0.31±n/a nM
Citation Schrimpf, MRSippy, KBBriggs, CAAnderson, DJLi, TJi, JFrost, JMSurowy, CSBunnelle, WHGopalakrishnan, MMeyer, MD SAR ofa7 nicotinic receptor agonists derived from tilorone: exploration of a novel nicotinic pharmacophore. Bioorg Med Chem Lett22:1633-8 (2012) 
 
Neuronal acetylcholine receptor subunit alpha-7
Name:Neuronal acetylcholine receptor subunit alpha-7
Type:Enzyme
Mol. Mass.:56502.44
Organism:Rattus norvegicus (Rat)
Description:Q05941
Residue:502
BDBM50364874
NameBDBM50364874
Synonyms:CHEMBL1950155
TypeSmall organic molecule
Emp. Form.C25H28N4O
Mol. Mass.400.516
SMILESO=C1c2cc(ccc2-c2ccc(cc12)N1CC2CNCC2C1)N1CC2CNCC2C1