Reaction Details
TargetNeuronal acetylcholine receptor subunit alpha-7
LigandBDBM50364877
Substrate/Competitorn/a
Meas. Tech.ChEMBL_803919 (CHEMBL1954606)
Ki 3.2±n/a nM
Citation Schrimpf, MRSippy, KBBriggs, CAAnderson, DJLi, TJi, JFrost, JMSurowy, CSBunnelle, WHGopalakrishnan, MMeyer, MD SAR ofa7 nicotinic receptor agonists derived from tilorone: exploration of a novel nicotinic pharmacophore. Bioorg Med Chem Lett22:1633-8 (2012) 
 
Neuronal acetylcholine receptor subunit alpha-7
Name:Neuronal acetylcholine receptor subunit alpha-7
Type:Enzyme
Mol. Mass.:56502.44
Organism:Rattus norvegicus (Rat)
Description:Q05941
Residue:502
BDBM50364877
NameBDBM50364877
Synonyms:CHEMBL1950158
TypeSmall organic molecule
Emp. Form.C20H19NO2
Mol. Mass.305.3704
SMILESO=C1c2ccccc2-c2ccc(O[C@H]3CN4CCC3CC4)cc12