Reaction Details
TargetEukaryotic translation initiation factor 4E
LigandBDBM50365102
Substrate/Competitorn/a
Meas. Tech.ChEMBL_804894 (CHEMBL1953942)
IC50 8490±n/a nM
Citation Rydzik, AMKulis, MLukaszewicz, MKowalska, JZuberek, JDarzynkiewicz, ZMDarzynkiewicz, EJemielity, J Synthesis and properties of mRNA cap analogs containing imidodiphosphate moiety--fairly mimicking natural cap structure, yet resistant to enzymatic hydrolysis. Bioorg Med Chem20:1699-710 (2012) 
 
Eukaryotic translation initiation factor 4E
Name:Eukaryotic translation initiation factor 4E
Type:PROTEIN
Mol. Mass.:25047.40
Organism:Oryctolagus cuniculus
Description:ChEMBL_1511842
Residue:217
BDBM50365102
NameBDBM50365102
Synonyms:CHEMBL1951191
TypeSmall organic molecule
Emp. Form.C21H27N11O17P3
Mol. Mass.798.4255
SMILESC[n+]1cn([C@@H]2O[C@H](COP([O-])(=O)OP([O-])(=O)NP([O-])(=O)OC[C@H]3O[C@H]([C@H](O)[C@@H]3O)n3cnc4c3nc(N)[nH]c4=O)[C@@H](O)[C@H]2O)c2nc(N)[n-]c(=O)c12