Reaction Details
TargetRho-associated protein kinase 1
LigandBDBM14032
Substrate/Competitorn/a
Meas. Tech.ChEMBL_807416 (CHEMBL1960787)
IC50<10±n/a nM
Citation Doe, CBentley, RBehm, DJLafferty, RStavenger, RJung, DBamford, MPanchal, TGrygielko, EWright, LLSmith, GKChen, ZWebb, CKhandekar, SYi, TKirkpatrick, RDul, EJolivette, LMarino, JPWillette, RLee, DHu, E Novel Rho kinase inhibitors with anti-inflammatory and vasodilatory activities. J Pharmacol Exp Ther320:89-98 (2006) 
 
Rho-associated protein kinase 1
Name:Rho-associated protein kinase 1
Type:Serine/threonine-protein kinase
Mol. Mass.:158156.77
Organism:Homo sapiens (Human)
Description:Q13464
Residue:1354
BDBM14032
NameBDBM14032
Synonyms:4-(1-ethyl-1H-imidazo[4,5-c]pyridin-2-yl)-1,2,5-oxadiazol-3-amine Aminofurazanyl-azabenzimidazole 1 | CHEMBL189657
TypeSmall organic molecule
Emp. Form.C10H10N6O
Mol. Mass.230.226
SMILESCCn1c(nc2cnccc12)-c1nonc1N