Reaction Details
TargetRAC-alpha serine/threonine-protein kinase
LigandBDBM50365218
Substrate/Competitorn/a
Meas. Tech.ChEMBL_807420 (CHEMBL1960791)
IC50 324±n/a nM
Citation Doe, CBentley, RBehm, DJLafferty, RStavenger, RJung, DBamford, MPanchal, TGrygielko, EWright, LLSmith, GKChen, ZWebb, CKhandekar, SYi, TKirkpatrick, RDul, EJolivette, LMarino, JPWillette, RLee, DHu, E Novel Rho kinase inhibitors with anti-inflammatory and vasodilatory activities. J Pharmacol Exp Ther320:89-98 (2006) 
 
RAC-alpha serine/threonine-protein kinase
Name:RAC-alpha serine/threonine-protein kinase
Type:Enzyme
Mol. Mass.:55681.25
Organism:Homo sapiens (Human)
Description:P31749
Residue:480
BDBM50365218
NameBDBM50365218
Synonyms:CHEMBL1956071 | GSK screening, 29
TypeSmall organic molecule
Emp. Form.C15H18N8O2
Mol. Mass.342.3558
SMILESCCn1c(nc2cncc(C(=O)N3CC[C@H](N)C3)c12)-c1nonc1N