Reaction Details
TargetRAC-beta serine/threonine-protein kinase
LigandBDBM14047
Substrate/Competitorn/a
Meas. Tech.ChEMBL_807421 (CHEMBL1960792)
IC50 1350±n/a nM
Citation Doe, CBentley, RBehm, DJLafferty, RStavenger, RJung, DBamford, MPanchal, TGrygielko, EWright, LLSmith, GKChen, ZWebb, CKhandekar, SYi, TKirkpatrick, RDul, EJolivette, LMarino, JPWillette, RLee, DHu, E Novel Rho kinase inhibitors with anti-inflammatory and vasodilatory activities. J Pharmacol Exp Ther320:89-98 (2006) 
 
RAC-beta serine/threonine-protein kinase
Name:RAC-beta serine/threonine-protein kinase
Type:Enzyme
Mol. Mass.:55766.64
Organism:Homo sapiens (Human)
Description:n/a
Residue:481
BDBM14047
NameBDBM14047
Synonyms:Aminofurazanyl-azabenzimidazole 6n | N-(3-{[2-(4-amino-1,2,5-oxadiazol-3-yl)-1-ethyl-1H-imidazo[4,5-c]pyridin-6-yl]oxy}phenyl)-4-[2-(morpholin-4-yl)ethoxy]benzamide
TypeSmall organic molecule
Emp. Form.C29H30N8O5
Mol. Mass.570.5991
SMILESCCn1c(nc2cnc(Oc3cccc(NC(=O)c4ccc(OCCN5CCOCC5)cc4)c3)cc12)-c1nonc1N