Reaction Details
TargetRho-associated protein kinase 1
LigandBDBM50365218
Substrate/Competitorn/a
Meas. Tech.ChEMBL_807416 (CHEMBL1960787)
IC50 5.6±n/a nM
Citation Doe, CBentley, RBehm, DJLafferty, RStavenger, RJung, DBamford, MPanchal, TGrygielko, EWright, LLSmith, GKChen, ZWebb, CKhandekar, SYi, TKirkpatrick, RDul, EJolivette, LMarino, JPWillette, RLee, DHu, E Novel Rho kinase inhibitors with anti-inflammatory and vasodilatory activities. J Pharmacol Exp Ther320:89-98 (2006) 
 
Rho-associated protein kinase 1
Name:Rho-associated protein kinase 1
Type:Serine/threonine-protein kinase
Mol. Mass.:158156.77
Organism:Homo sapiens (Human)
Description:Q13464
Residue:1354
BDBM50365218
NameBDBM50365218
Synonyms:CHEMBL1956071 | GSK screening, 29
TypeSmall organic molecule
Emp. Form.C15H18N8O2
Mol. Mass.342.3558
SMILESCCn1c(nc2cncc(C(=O)N3CC[C@H](N)C3)c12)-c1nonc1N