Reaction Details
TargetRenin
LigandBDBM50365561
Substrate/Competitorn/a
Meas. Tech.ChEMBL_808016 (CHEMBL1961075)
IC50 0.5±n/a nM
Citation Lacombe, PArbour, MAspiotis, RCauchon, EChen, ADubé, DFalgueyret, JPFournier, PAGallant, MGrimm, EHan, YJuteau, HLiu, SMellon, CRamtohul, YSimard, DSt-Jacques, RTsui, GC 3,4-Diarylpiperidines as potent renin inhibitors. Bioorg Med Chem Lett22:1953-7 (2012) 
 
Renin
Name:Renin
Type:Enzyme
Mol. Mass.:45058.99
Organism:Homo sapiens (Human)
Description:n/a
Residue:406
BDBM50365561
NameBDBM50365561
Synonyms:CHEMBL1957676
TypeSmall organic molecule
Emp. Form.C27H27ClF2N2O
Mol. Mass.468.966
SMILESCC(=O)NCCc1ccccc1-c1ccc([C@H]2CNCC[C@@H]2c2ccc(F)c(F)c2)c(Cl)c1