Reaction Details
TargetMAP kinase-activated protein kinase 5
LigandBDBM50365790
Substrate/Competitorn/a
Meas. Tech.ChEMBL_806119 (CHEMBL1960722)
IC50>10000±n/a nM
Citation Andrews, MJClase, JABar, GTricarico, GEdwards, PJBrys, RChambers, MSchmidt, WMacLeod, AHirst, KAllen, VBirault, VLe, JHarris, JSelf, ANash, KDixon, G Discovery of a series of imidazopyrazine small molecule inhibitors of the kinase MAPKAPK5, that show activity using in vitro and in vivo models of rheumatoid arthritis. Bioorg Med Chem Lett22:2266-70 (2012) 
 
MAP kinase-activated protein kinase 5
Name:MAP kinase-activated protein kinase 5
Type:Serine/threonine-protein kinase
Mol. Mass.:54229.92
Organism:Homo sapiens (Human)
Description:Recombinant MAPKAPK5 was phosphorylated by incubation with active p38alpha before assays.
Residue:473
BDBM50365790
NameBDBM50365790
Synonyms:CHEMBL1956569
TypeSmall organic molecule
Emp. Form.C23H25N7O
Mol. Mass.415.4909
SMILESCN(C)c1cc(ccn1)-c1cnc(Nc2ccc(cc2)N2CCOCC2)c2nccn12