Reaction Details
TargetMAP kinase-activated protein kinase 5
LigandBDBM50365802
Substrate/Competitorn/a
Meas. Tech.ChEMBL_806119 (CHEMBL1960722)
IC50 3730±n/a nM
Citation Andrews, MJClase, JABar, GTricarico, GEdwards, PJBrys, RChambers, MSchmidt, WMacLeod, AHirst, KAllen, VBirault, VLe, JHarris, JSelf, ANash, KDixon, G Discovery of a series of imidazopyrazine small molecule inhibitors of the kinase MAPKAPK5, that show activity using in vitro and in vivo models of rheumatoid arthritis. Bioorg Med Chem Lett22:2266-70 (2012) 
 
MAP kinase-activated protein kinase 5
Name:MAP kinase-activated protein kinase 5
Type:Serine/threonine-protein kinase
Mol. Mass.:54229.92
Organism:Homo sapiens (Human)
Description:Recombinant MAPKAPK5 was phosphorylated by incubation with active p38alpha before assays.
Residue:473
BDBM50365802
NameBDBM50365802
Synonyms:CHEMBL1956683
TypeSmall organic molecule
Emp. Form.C21H22N8O
Mol. Mass.402.4524
SMILESCN1CCN(CC1)c1ccc(Nc2ncc(-c3cc[nH]c(=O)c3)n3ncnc23)cc1