Reaction Details
TargetcAMP and cAMP-inhibited cGMP 3',5'-cyclic phosphodiesterase 10A
LigandBDBM50365964
Substrate/Competitorn/a
Meas. Tech.ChEMBL_807171 (CHEMBL1959835)
IC50 2±n/a nM
Citation Hu, EKunz, RKRumfelt, SChen, NBürli, RLi, CAndrews, KLZhang, JChmait, SKogan, JLindstrom, MHitchcock, SATreanor, J Discovery of potent, selective, and metabolically stable 4-(pyridin-3-yl)cinnolines as novel phosphodiesterase 10A (PDE10A) inhibitors. Bioorg Med Chem Lett22:2262-5 (2012) 
 
cAMP and cAMP-inhibited cGMP 3',5'-cyclic phosphodiesterase 10A
Name:cAMP and cAMP-inhibited cGMP 3',5'-cyclic phosphodiesterase 10A
Type:Protein
Mol. Mass.:88412.52
Organism:Homo sapiens (Human)
Description:Q9Y233
Residue:1055
BDBM50365964
NameBDBM50365964
Synonyms:CHEMBL1956235 | CHEMBL2070530
TypeSmall organic molecule
Emp. Form.C19H22N4O2
Mol. Mass.338.4036
SMILESCOc1cc2nncc(-c3cnc(NC(C)C)c(C)c3)c2cc1OC