Reaction Details
TargetCarbonic anhydrase 1
LigandBDBM50366054
Substrate/Competitorn/a
Meas. Tech.ChEMBL_807742 (CHEMBL1959870)
Ki 7500±n/a nM
Citation Moeker, JTeruya, KRossit, SWilkinson, BLLopez, MBornaghi, LFInnocenti, ASupuran, CTPoulsen, SA Design and synthesis of thiourea compounds that inhibit transmembrane anchored carbonic anhydrases. Bioorg Med Chem20:2392-404 (2012) 
 
Carbonic anhydrase 1
Name:Carbonic anhydrase 1
Type:Enzyme
Mol. Mass.:28873.37
Organism:Homo sapiens (Human)
Description:P00915
Residue:261
BDBM50366054
NameBDBM50366054
Synonyms:CHEMBL1956760
TypeSmall organic molecule
Emp. Form.C14H21N3O7S2
Mol. Mass.407.462
SMILESNS(=O)(=O)c1ccc(CNC(=S)N[C@@H]2O[C@H](CO)[C@@H](O)[C@H](O)[C@H]2O)cc1