Reaction Details
TargetCarbonic anhydrase 9
LigandBDBM50366076
Substrate/Competitorn/a
Meas. Tech.ChEMBL_807744 (CHEMBL1959872)
Ki 3.3±n/a nM
Citation Moeker, JTeruya, KRossit, SWilkinson, BLLopez, MBornaghi, LFInnocenti, ASupuran, CTPoulsen, SA Design and synthesis of thiourea compounds that inhibit transmembrane anchored carbonic anhydrases. Bioorg Med Chem20:2392-404 (2012) 
 
Carbonic anhydrase 9
Name:Carbonic anhydrase 9
Type:Enzyme
Mol. Mass.:49669.03
Organism:Homo sapiens (Human)
Description:Catalytic domain of human cloned isozyme was used in the assay
Residue:459
BDBM50366076
NameBDBM50366076
Synonyms:CHEMBL1956750
TypeSmall organic molecule
Emp. Form.C22H28N4O12S2
Mol. Mass.604.607
SMILESCC(=O)OC[C@H]1O[C@@H](NC(=S)NNC(=O)c2ccc(cc2)S(N)(=O)=O)[C@H](OC(C)=O)[C@@H](OC(C)=O)[C@H]1OC(C)=O