Reaction Details
TargetCarbonic anhydrase 9
LigandBDBM50366059
Substrate/Competitorn/a
Meas. Tech.ChEMBL_807744 (CHEMBL1959872)
Ki 2.8±n/a nM
Citation Moeker, JTeruya, KRossit, SWilkinson, BLLopez, MBornaghi, LFInnocenti, ASupuran, CTPoulsen, SA Design and synthesis of thiourea compounds that inhibit transmembrane anchored carbonic anhydrases. Bioorg Med Chem20:2392-404 (2012) 
 
Carbonic anhydrase 9
Name:Carbonic anhydrase 9
Type:Enzyme
Mol. Mass.:49669.03
Organism:Homo sapiens (Human)
Description:Catalytic domain of human cloned isozyme was used in the assay
Residue:459
BDBM50366059
NameBDBM50366059
Synonyms:CHEMBL1956765
TypeSmall organic molecule
Emp. Form.C15H23N3O7S2
Mol. Mass.421.489
SMILESNS(=O)(=O)c1ccc(CCNC(=S)N[C@@H]2O[C@H](CO)[C@H](O)[C@H](O)[C@H]2O)cc1