Reaction Details
TargetCarbonic anhydrase 12
LigandBDBM50366070
Substrate/Competitorn/a
Meas. Tech.ChEMBL_807745 (CHEMBL1959873)
Ki 7.5±n/a nM
Citation Moeker, JTeruya, KRossit, SWilkinson, BLLopez, MBornaghi, LFInnocenti, ASupuran, CTPoulsen, SA Design and synthesis of thiourea compounds that inhibit transmembrane anchored carbonic anhydrases. Bioorg Med Chem20:2392-404 (2012) 
 
Carbonic anhydrase 12
Name:Carbonic anhydrase 12
Type:Enzyme
Mol. Mass.:39456.00
Organism:Homo sapiens (Human)
Description:Catalytic domain of human cloned isozyme was used in the assay
Residue:354
BDBM50366070
NameBDBM50366070
Synonyms:CHEMBL1956744
TypeSmall organic molecule
Emp. Form.C22H29N3O11S2
Mol. Mass.575.609
SMILESCC(=O)OC[C@H]1O[C@@H](NC(=S)NCc2ccc(cc2)S(N)(=O)=O)[C@H](OC(C)=O)[C@@H](OC(C)=O)[C@@H]1OC(C)=O