Reaction Details
TargetCarbonic anhydrase 12
LigandBDBM10860
Substrate/Competitorn/a
Meas. Tech.ChEMBL_807745 (CHEMBL1959873)
Ki 0.3±n/a nM
Citation Moeker, JTeruya, KRossit, SWilkinson, BLLopez, MBornaghi, LFInnocenti, ASupuran, CTPoulsen, SA Design and synthesis of thiourea compounds that inhibit transmembrane anchored carbonic anhydrases. Bioorg Med Chem20:2392-404 (2012) 
 
Carbonic anhydrase 12
Name:Carbonic anhydrase 12
Type:Enzyme
Mol. Mass.:39456.00
Organism:Homo sapiens (Human)
Description:Catalytic domain of human cloned isozyme was used in the assay
Residue:354
BDBM10860
NameBDBM10860
Synonyms:4-(aminomethyl)benzene-1-sulfonamide MAFENIDE aromatic/heteroaromatic sulfonamide 5 | hCA inhibitor, 9
TypeSmall organic molecule
Emp. Form.C7H10N2O2S
Mol. Mass.186.232
SMILESNCc1ccc(cc1)S(N)(=O)=O