Reaction Details
TargetCarbonic anhydrase 14
LigandBDBM50366049
Substrate/Competitorn/a
Meas. Tech.ChEMBL_807746 (CHEMBL1959874)
Ki 8.6±n/a nM
Citation Moeker, JTeruya, KRossit, SWilkinson, BLLopez, MBornaghi, LFInnocenti, ASupuran, CTPoulsen, SA Design and synthesis of thiourea compounds that inhibit transmembrane anchored carbonic anhydrases. Bioorg Med Chem20:2392-404 (2012) 
 
Carbonic anhydrase 14
Name:Carbonic anhydrase 14
Type:Enzyme
Mol. Mass.:37665.67
Organism:Homo sapiens (Human)
Description:Human (cloned) isozyme.
Residue:337
BDBM50366049
NameBDBM50366049
Synonyms:CHEMBL1956755
TypeSmall organic molecule
Emp. Form.C33H43N3O19S2
Mol. Mass.849.833
SMILESCC(=O)OC[C@H]1O[C@@H](NC(=S)Nc2ccc(cc2)S(N)(=O)=O)[C@H](OC(C)=O)[C@@H](OC(C)=O)[C@@H]1O[C@@H]1O[C@H](COC(C)=O)[C@H](OC(C)=O)[C@H](OC(C)=O)[C@H]1OC(C)=O