Reaction Details
TargetCarbonic anhydrase 14
LigandBDBM50366063
Substrate/Competitorn/a
Meas. Tech.ChEMBL_807746 (CHEMBL1959874)
Ki 7.8±n/a nM
Citation Moeker, JTeruya, KRossit, SWilkinson, BLLopez, MBornaghi, LFInnocenti, ASupuran, CTPoulsen, SA Design and synthesis of thiourea compounds that inhibit transmembrane anchored carbonic anhydrases. Bioorg Med Chem20:2392-404 (2012) 
 
Carbonic anhydrase 14
Name:Carbonic anhydrase 14
Type:Enzyme
Mol. Mass.:37665.67
Organism:Homo sapiens (Human)
Description:Human (cloned) isozyme.
Residue:337
BDBM50366063
NameBDBM50366063
Synonyms:CHEMBL1956769
TypeSmall organic molecule
Emp. Form.C21H33N3O12S2
Mol. Mass.583.63
SMILESNS(=O)(=O)c1ccc(CCNC(=S)N[C@@H]2O[C@H](CO)[C@@H](O[C@H]3O[C@H](CO)[C@@H](O)[C@H](O)[C@H]3O)[C@H](O)[C@H]2O)cc1