Reaction Details
TargetAromatase
LigandBDBM50366131
Substrate/Competitorn/a
Meas. Tech.ChEMBL_808291 (CHEMBL1961308)
Ki 1482±n/a nM
Citation Mayhoub, ASMarler, LKondratyuk, TPPark, EJPezzuto, JMCushman, M Optimization of the aromatase inhibitory activities of pyridylthiazole analogues of resveratrol. Bioorg Med Chem20:2427-34 (2012) 
 
Aromatase
Name:Aromatase
Type:Enzyme
Mol. Mass.:57888.92
Organism:Homo sapiens (Human)
Description:P11511
Residue:503
BDBM50366131
NameBDBM50366131
Synonyms:CHEMBL1957220
TypeSmall organic molecule
Emp. Form.C13H8BrN3S
Mol. Mass.318.192
SMILESBrc1ccc(cn1)-c1csc(n1)-c1cccnc1