Reaction Details
TargetAromatase
LigandBDBM50366127
Substrate/Competitorn/a
Meas. Tech.ChEMBL_808290 (CHEMBL1961307)
IC50 164±n/a nM
Citation Mayhoub, ASMarler, LKondratyuk, TPPark, EJPezzuto, JMCushman, M Optimization of the aromatase inhibitory activities of pyridylthiazole analogues of resveratrol. Bioorg Med Chem20:2427-34 (2012) 
 
Aromatase
Name:Aromatase
Type:Enzyme
Mol. Mass.:57888.92
Organism:Homo sapiens (Human)
Description:P11511
Residue:503
BDBM50366127
NameBDBM50366127
Synonyms:CHEMBL1957216
TypeSmall organic molecule
Emp. Form.C13H8ClN3S
Mol. Mass.273.741
SMILESClc1cc(ccn1)-c1nc(cs1)-c1cccnc1