Reaction Details
TargetAromatase
LigandBDBM13061
Substrate/Competitorn/a
Meas. Tech.ChEMBL_808291 (CHEMBL1961308)
Ki 0.02±n/a nM
Citation Mayhoub, ASMarler, LKondratyuk, TPPark, EJPezzuto, JMCushman, M Optimization of the aromatase inhibitory activities of pyridylthiazole analogues of resveratrol. Bioorg Med Chem20:2427-34 (2012) 
 
Aromatase
Name:Aromatase
Type:Enzyme
Mol. Mass.:57888.92
Organism:Homo sapiens (Human)
Description:P11511
Residue:503
BDBM13061
NameBDBM13061
Synonyms:4,4 -(1H-1,2,4-triazol-1-ylmethanediyl)dibenzonitrile CHEMBL1444 | Letrozole
TypeSmall organic molecule
Emp. Form.C17H11N5
Mol. Mass.285.3027
SMILESN#Cc1ccc(cc1)C(c1ccc(cc1)C#N)n1cncn1