Reaction Details
TargetMatrix metalloproteinase-14
LigandBDBM50366175
Substrate/Competitorn/a
Meas. Tech.ChEMBL_805647 (CHEMBL1960481)
IC50 5±n/a nM
Citation Topai, ABreccia, PMinissi, FPadova, AMarini, SCerbara, I In silico scaffold evaluation and solid phase approach to identify new gelatinase inhibitors. Bioorg Med Chem20:2323-37 (2012) 
 
Matrix metalloproteinase-14
Name:Matrix metalloproteinase-14
Type:Protein
Mol. Mass.:65900.19
Organism:Homo sapiens (Human)
Description:P50281
Residue:582
BDBM50366175
NameBDBM50366175
Synonyms:CHEMBL1957606
TypeSmall organic molecule
Emp. Form.C16H15ClN2O7S2
Mol. Mass.446.883
SMILESONC(=O)[C@@H]1CS(=O)(=O)CN1S(=O)(=O)c1ccc(Oc2ccc(Cl)cc2)cc1