Reaction Details
TargetMu-type opioid receptor
LigandBDBM50280516
Substrate/Competitorn/a
Meas. Tech.ChEBML_222066
Ki 304±n/a nM
Citation Rajagopalan, PScribner, RPennev, PSchmidt, WTam, SSteinfels, GCook, L DuP 747: a new, potent, kappa opioid analgesic. Synthesis and pharmacology1. Bioorg Med Chem Lett2:715-720 (1992)    Article
 
Mu-type opioid receptor
Name:Mu-type opioid receptor
Type:G Protein-Coupled Receptor (GPCR)
Mol. Mass.:44789.51
Organism:Homo sapiens (Human)
Description:P35372
Residue:400
BDBM50280516
NameBDBM50280516
Synonyms:2-(3,4-Dichloro-phenyl)-N-((1S,2S)-5-methoxy-2-pyrrolidin-1-yl-1,2,3,4-tetrahydro-naphthalen-1-yl)-N-methyl-acetamide; compound with methanesulfonic acid | CHEMBL350943
TypeSmall organic molecule
Emp. Form.C24H28Cl2N2O2
Mol. Mass.447.397
SMILESCOc1cccc2[C@@H]([C@H](CCc12)N1CCCC1)N(C)C(=O)Cc1ccc(Cl)c(Cl)c1