Reaction Details
TargetSigma non-opioid intracellular receptor 1
LigandBDBM50280516
Substrate/Competitorn/a
Meas. Tech.ChEBML_226539
Ki 5160±n/a nM
Citation Rajagopalan, PScribner, RPennev, PSchmidt, WTam, SSteinfels, GCook, L DuP 747: a new, potent, kappa opioid analgesic. Synthesis and pharmacology1. Bioorg Med Chem Lett2:715-720 (1992)    Article
 
Sigma non-opioid intracellular receptor 1
Name:Sigma non-opioid intracellular receptor 1
Type:Enzyme Catalytic Domain
Mol. Mass.:25124.85
Organism:Homo sapiens (Human)
Description:Q99720
Residue:223
BDBM50280516
NameBDBM50280516
Synonyms:2-(3,4-Dichloro-phenyl)-N-((1S,2S)-5-methoxy-2-pyrrolidin-1-yl-1,2,3,4-tetrahydro-naphthalen-1-yl)-N-methyl-acetamide; compound with methanesulfonic acid | CHEMBL350943
TypeSmall organic molecule
Emp. Form.C24H28Cl2N2O2
Mol. Mass.447.397
SMILESCOc1cccc2[C@@H]([C@H](CCc12)N1CCCC1)N(C)C(=O)Cc1ccc(Cl)c(Cl)c1