Reaction Details
TargetSodium-dependent dopamine transporter
LigandBDBM50004167
Substrate/Competitorn/a
Meas. Tech.ChEMBL_62807 (CHEMBL674120)
IC50 0.360000±n/a nM
Citation Kozikowski, APRoberti, MJohnson, KMBergmann, JSBall, RG SAR of cocaine: further exploration of structural variations at the C-2 center provides compounds of subnanomolar binding potency Bioorg Med Chem Lett3:1327-1332 (1993)    Article
 
Sodium-dependent dopamine transporter
Name:Sodium-dependent dopamine transporter
Type:Multi-pass membrane protein
Mol. Mass.:68497.11
Organism:Homo sapiens (Human)
Description:Q01959
Residue:620
BDBM50004167
NameBDBM50004167
Synonyms:(2R,3S)-3-(4-Chloro-phenyl)-2-((E)-2-chloro-vinyl)-8-methyl-8-aza-bicyclo[3.2.1]octane CHEMBL28394
TypeSmall organic molecule
Emp. Form.C16H19Cl2N
Mol. Mass.296.235
SMILESCN1C2CCC1[C@@H](\C=C\Cl)[C@H](C2)c1ccc(Cl)cc1