Reaction Details
TargetSodium-dependent dopamine transporter
LigandBDBM50032533
Substrate/Competitorn/a
Meas. Tech.ChEMBL_62807 (CHEMBL674120)
IC50 3.5±n/a nM
Citation Kozikowski, APRoberti, MJohnson, KMBergmann, JSBall, RG SAR of cocaine: further exploration of structural variations at the C-2 center provides compounds of subnanomolar binding potency Bioorg Med Chem Lett3:1327-1332 (1993)    Article
 
Sodium-dependent dopamine transporter
Name:Sodium-dependent dopamine transporter
Type:Multi-pass membrane protein
Mol. Mass.:68497.11
Organism:Homo sapiens (Human)
Description:Q01959
Residue:620
BDBM50032533
NameBDBM50032533
Synonyms:(2S,3S)-3-(4-Chloro-phenyl)-2-ethyl-8-methyl-8-aza-bicyclo[3.2.1]octane | CHEMBL27336
TypeSmall organic molecule
Emp. Form.C16H22ClN
Mol. Mass.263.806
SMILESCC[C@@H]1C2CCC(C[C@@H]1c1ccc(Cl)cc1)N2C