Reaction Details
TargetPlatelet-activating factor receptor
LigandBDBM50282033
Substrate/Competitorn/a
Meas. Tech.ChEBML_155135
IC50 2000±n/a nM
Citation Wood, LWhittaker, MTimmis, DJThompson, TMSaroglou, LMiller, ADavidson, AHChristodoulou, MSCackett, KSBowles, SABebbington, DS Cyclic ether acetal platelet activating factor (PAF) receptor antagonists II: imidazo[4,5-c]pyridyl derivatives Bioorg Med Chem Lett3:1499-1504 (1993)    Article
 
Platelet-activating factor receptor
Name:Platelet-activating factor receptor
Type:Enzyme Catalytic Domain
Mol. Mass.:39219.60
Organism:Homo sapiens (Human)
Description:PAF Platelet activating factor PTAFR HUMAN::P25105
Residue:342
BDBM50282033
NameBDBM50282033
Synonyms:1-{4-[5-(3,4-Dimethoxy-phenyl)-tetrahydro-furan-2-yloxymethyl]-benzyl}-2-methyl-1H-benzoimidazole | CHEMBL37792
TypeSmall organic molecule
Emp. Form.C28H30N2O4
Mol. Mass.458.5488
SMILESCOc1ccc(cc1OC)C1CCC(OCc2ccc(Cn3c(C)nc4ccccc34)cc2)O1