Reaction Details
TargetPlatelet-activating factor receptor
LigandBDBM50282040
Substrate/Competitorn/a
Meas. Tech.ChEBML_155135
IC50 100±n/a nM
Citation Wood, LWhittaker, MTimmis, DJThompson, TMSaroglou, LMiller, ADavidson, AHChristodoulou, MSCackett, KSBowles, SABebbington, DS Cyclic ether acetal platelet activating factor (PAF) receptor antagonists II: imidazo[4,5-c]pyridyl derivatives Bioorg Med Chem Lett3:1499-1504 (1993)    Article
 
Platelet-activating factor receptor
Name:Platelet-activating factor receptor
Type:Enzyme Catalytic Domain
Mol. Mass.:39219.60
Organism:Homo sapiens (Human)
Description:PAF Platelet activating factor PTAFR HUMAN::P25105
Residue:342
BDBM50282040
NameBDBM50282040
Synonyms:3-{3-[(2R,5S)-5-(3,4,5-Trimethoxy-phenyl)-tetrahydro-furan-2-yloxy]-propyl}-pyridine | CHEMBL36269
TypeSmall organic molecule
Emp. Form.C21H27NO5
Mol. Mass.373.4428
SMILESCOc1cc(cc(OC)c1OC)[C@@H]1CC[C@H](OCCCc2cccnc2)O1