Reaction Details
TargetPlatelet-activating factor receptor
LigandBDBM50280482
Substrate/Competitorn/a
Meas. Tech.ChEBML_155135
IC50 300±n/a nM
Citation Wood, LWhittaker, MTimmis, DJThompson, TMSaroglou, LMiller, ADavidson, AHChristodoulou, MSCackett, KSBowles, SABebbington, DS Cyclic ether acetal platelet activating factor (PAF) receptor antagonists II: imidazo[4,5-c]pyridyl derivatives Bioorg Med Chem Lett3:1499-1504 (1993)    Article
 
Platelet-activating factor receptor
Name:Platelet-activating factor receptor
Type:Enzyme Catalytic Domain
Mol. Mass.:39219.60
Organism:Homo sapiens (Human)
Description:PAF Platelet activating factor PTAFR HUMAN::P25105
Residue:342
BDBM50280482
NameBDBM50280482
Synonyms:BB-182 N-Cyclohexyl-N-methyl-4-(2-methyl-benzoimidazol-1-ylmethyl)-benzenesulfonamide
TypeSmall organic molecule
Emp. Form.C22H27N3O2S
Mol. Mass.397.534
SMILESCN(C1CCCCC1)S(=O)(=O)c1ccc(Cn2c(C)nc3ccccc23)cc1