Reaction Details
TargetPlatelet-activating factor receptor
LigandBDBM50282043
Substrate/Competitorn/a
Meas. Tech.ChEBML_155135
IC50 250±n/a nM
Citation Wood, LWhittaker, MTimmis, DJThompson, TMSaroglou, LMiller, ADavidson, AHChristodoulou, MSCackett, KSBowles, SABebbington, DS Cyclic ether acetal platelet activating factor (PAF) receptor antagonists II: imidazo[4,5-c]pyridyl derivatives Bioorg Med Chem Lett3:1499-1504 (1993)    Article
 
Platelet-activating factor receptor
Name:Platelet-activating factor receptor
Type:Enzyme Catalytic Domain
Mol. Mass.:39219.60
Organism:Homo sapiens (Human)
Description:PAF Platelet activating factor PTAFR HUMAN::P25105
Residue:342
BDBM50282043
NameBDBM50282043
Synonyms:4-{3-[5-(3,4-Dimethoxy-phenyl)-tetrahydro-furan-2-yloxy]-propyl}-3,5-dimethyl-4H-[1,2,4]triazole | CHEMBL286696
TypeSmall organic molecule
Emp. Form.C19H27N3O4
Mol. Mass.361.4354
SMILESCOc1ccc(cc1OC)C1CCC(OCCCn2c(C)nnc2C)O1