Reaction Details
TargetPlatelet-activating factor receptor
LigandBDBM50282046
Substrate/Competitorn/a
Meas. Tech.ChEBML_155135
IC50 190±n/a nM
Citation Wood, LWhittaker, MTimmis, DJThompson, TMSaroglou, LMiller, ADavidson, AHChristodoulou, MSCackett, KSBowles, SABebbington, DS Cyclic ether acetal platelet activating factor (PAF) receptor antagonists II: imidazo[4,5-c]pyridyl derivatives Bioorg Med Chem Lett3:1499-1504 (1993)    Article
 
Platelet-activating factor receptor
Name:Platelet-activating factor receptor
Type:Enzyme Catalytic Domain
Mol. Mass.:39219.60
Organism:Homo sapiens (Human)
Description:PAF Platelet activating factor PTAFR HUMAN::P25105
Residue:342
BDBM50282046
NameBDBM50282046
Synonyms:2-Methyl-1-[3-(5-phenyl-tetrahydro-furan-2-yloxy)-propyl]-1H-imidazo[4,5-c]pyridine | CHEMBL36154
TypeSmall organic molecule
Emp. Form.C20H23N3O2
Mol. Mass.337.4155
SMILESCc1nc2cnccc2n1CCCOC1CCC(O1)c1ccccc1