Reaction Details
TargetPlatelet-activating factor receptor
LigandBDBM50282047
Substrate/Competitorn/a
Meas. Tech.ChEBML_155135
IC50 120±n/a nM
Citation Wood, LWhittaker, MTimmis, DJThompson, TMSaroglou, LMiller, ADavidson, AHChristodoulou, MSCackett, KSBowles, SABebbington, DS Cyclic ether acetal platelet activating factor (PAF) receptor antagonists II: imidazo[4,5-c]pyridyl derivatives Bioorg Med Chem Lett3:1499-1504 (1993)    Article
 
Platelet-activating factor receptor
Name:Platelet-activating factor receptor
Type:Enzyme Catalytic Domain
Mol. Mass.:39219.60
Organism:Homo sapiens (Human)
Description:PAF Platelet activating factor PTAFR HUMAN::P25105
Residue:342
BDBM50282047
NameBDBM50282047
Synonyms:1-[3-(5-Heptyl-tetrahydro-furan-2-yloxy)-propyl]-2-methyl-1H-imidazo[4,5-c]pyridine | CHEMBL34612
TypeSmall organic molecule
Emp. Form.C21H33N3O2
Mol. Mass.359.5056
SMILESCCCCCCCC1CCC(OCCCn2c(C)nc3cnccc23)O1