Reaction Details
TargetNeprilysin
LigandBDBM50024101
Substrate/Competitorn/a
Meas. Tech.ChEBML_144599
IC50 5.7±n/a nM
Citation Delaney, NGBarrish, JCNeubeck, RNatarajan, SCohen, MRovnyak, GCHuber, GMurugesan, NGirotra, RSieber-McMaster, ERobl, JAAsaad, MMCheung, HSBird, JWaldron, TPetrillo, EW Mercaptoacyl dipeptides as dual inhibitors of angiotensin-converting enzyme and neutral endopeptidase. Preliminary structure-activity studies Bioorg Med Chem Lett4:1783-1788 (1994)    Article
 
Neprilysin
Name:Neprilysin
Type:Protein
Mol. Mass.:85789.59
Organism:Rattus norvegicus (Rat)
Description:P07861
Residue:750
BDBM50024101
NameBDBM50024101
Synonyms:(S)-2-((S)-2-Mercaptomethyl-3-phenyl-propionylamino)-propionic acid CHEMBL51715
TypeSmall organic molecule
Emp. Form.C13H17NO3S
Mol. Mass.267.344
SMILESC[C@H](NC(=O)[C@@H](CS)Cc1ccccc1)C(O)=O