Reaction Details
TargetSodium-dependent dopamine transporter
LigandBDBM50283376
Substrate/Competitorn/a
Meas. Tech.ChEBML_62470
Ki 700±n/a nM
Citation Stoelwinder, JRoberti, MKozikowski, APJohnson, KMBergmann, JS Differential binding and dopamine uptake activity of cocaine analogues modified at nitrogen Bioorg Med Chem Lett4:303-308 (1994)    Article
 
Sodium-dependent dopamine transporter
Name:Sodium-dependent dopamine transporter
Type:Multi-pass membrane protein
Mol. Mass.:68749.45
Organism:Rattus norvegicus (rat)
Description:P23977
Residue:619
BDBM50283376
NameBDBM50283376
Synonyms:3-Benzoyloxy-8-(2-hydroxy-ethyl)-8-aza-bicyclo[3.2.1]octane-2-carboxylic acid methyl ester; hydrochloride | CHEMBL538517
TypeSmall organic molecule
Emp. Form.C18H23NO5
Mol. Mass.333.3789
SMILESCOC(=O)C1C2CCC(CC1OC(=O)c1ccccc1)N2CCO